Tag: android gradle

Android NoClassDefFoundError: com.google.firebase.FirebaseOptions

Wenn ich meine Codes betreibe, gibt Adroid Studio diesen Fehler Meine gradle Datei wie unten unter und Android Studio v2.2 gradle ist 'com.android.tools.build:gradle:2.2.0-alpha1' apply plugin: 'com.android.application' android { compileSdkVersion 23 buildToolsVersion "23.0.2" packagingOptions { exclude 'META-INF/DEPENDENCIES' } defaultConfig { applicationId "com.asd.asd" minSdkVersion 14 targetSdkVersion 23 versionCode 9 versionName "1.3.4" multiDexEnabled true } buildTypes { release […]

AS zwingen, Android SDK Build Tools verwenden 25.0.0 SDK Build Tools Revision (23.0.3) ist zu niedrig für das Projekt

Hallo ich bin vor Build-Version Problem. Wenn ich die App ausführen, wirft es einen Fehler, dass, Fehler: Die SDK Build Tools Revision (23.0.3) ist zu niedrig für das Projekt ': Yampp'. Mindestens erforderlich ist 25.0.0 Ich muss 23.0.3 verwenden, aber es ist zwingend, 25.0.0 zu verwenden. Wie kann ich das seltsame Problem lösen? Hier sind […]

Android Studio 2.0 – NoSuchAlgorithmException: SHA256WITHDSA Signatur nicht verfügbar

Ich laufe Android Studio 2.0 Preview 3b und versuche, "Generate Signed APK …" aus dem Menü " Build" zu verwenden . Ich bekomme folgende Fehlermeldungen: :wear:packageRelease FAILED FAILURE: Build failed with an exception. * Exception is: org.gradle.api.tasks.TaskExecutionException: Execution failed for task ':wear:packageRelease'. at org.gradle.api.internal.tasks.execution.ExecuteActionsTaskExecuter.executeActions(ExecuteActionsTaskExecuter.java:69) at org.gradle.api.internal.tasks.execution.ExecuteActionsTaskExecuter.execute(ExecuteActionsTaskExecuter.java:46) … Error:org.gradle.tooling.BuildException: SHA256WITHDSA Signature not available: try using a […]

Gradle Kompilierungsfehler "Keine Signatur der Methode"

Wenn ich versuche zu laufen ./gradlew build.gradle vom Terminal, habe ich immer folgende Fehler: > No signature of method: org.gradle.api.internal.artifacts.dsl.dependencies.DefaultDependencyHandler.compile() is applicable for argument types: (org.gradle.api.internal.project.DefaultProject_Decorated) values: [project ':TestMobile'] Possible solutions: module(java.lang.Object) Ich habe versucht, Java-Plugin auf root build.gradle Datei und auch auf Sub-Projekte. Aber trotzdem bekomme ich den gleichen Fehler. Ich habe folgende Projektstruktur: […]

Android DSL Dokumentation für gradle

Für gradle gibt es einen Basissatz für die dsl: http://www.gradle.org/docs/current/dsl/ Vielleicht bin ich einfach nur blind, aber ich kann nicht scheinen, ein gleichwertiges Set von detaillierten Dokumentationen für Android zu finden. ๐Ÿ™ Jede Hilfe wäre sehr dankbar. ๐Ÿ™‚

Running AspectJ verursacht NoSuchMethodError: Aspect.aspectOf

Ich habe einen sehr einfachen AspectJ-Aspekt (mit @AspectJ), der nur eine Log-Nachricht ausdruckt. Mein Ziel ist es, Ratschläge in meinem Android-Anwendung. Jetzt funktioniert dieses Bild ganz gut, solange ich die Aspektklasse selbst in meinem Anwendungsquellcode habe. Sobald ich den Aspekt in ein anderes Modul verschiebe (entweder java -> .jar oder android lib -> .aar) bekomme […]

9 Patch-Bild verhindern Build-Projekt Android-Studio

Ich ziehe nach Gradle auf. Aber ich habe diesen Fehler für viele 9-Patch-Bilder. Beachten Sie die Ziehbar ist automatisch von http://android-holo-colors.com generiert, aber sie sind alt. Ich benutze Android-Studio 0.5.1 und meine Build-Tool-Version ist 19.0.3 Dies ist der Fehler Error:Execution failed for task ':app:mergeDebugResources'. > Error: Failed to run command: /Applications/Android Studio.app/sdk/build-tools/19.0.3/aapt s -i /Users/Ed/Desktop/TestAndroid/app/src/main/res/drawable-mdpi/spinner_default_holo_dark.9.png […]

Android Studio 3.0 Gradle Sync fehlgeschlagen: java.lang.AssertionError (in UnresolvedDependenciesReporter)

Bei der Migration auf Android Studio 3.0-beta1, bin ich in einem gradle Sync fehlgeschlagen Fehler, der nicht viel Info. Es gibt keine Fehlermeldung in der Gradle-Konsole. Ich musste in die idea.log-Datei gehen, um die folgende Stack-Trace zu bekommen: java.lang.RuntimeException: java.lang.AssertionError at com.intellij.openapi.application.TransactionGuardImpl.submitTransactionAndWait(TransactionGuardImpl.java:174) at com.intellij.openapi.command.WriteCommandAction.execute(WriteCommandAction.java:155) at com.android.tools.idea.gradle.project.sync.idea.data.service.ModuleModelDataService.importData(ModuleModelDataService.java:80) at com.android.tools.idea.gradle.project.sync.idea.data.service.ModuleModelDataService.importData(ModuleModelDataService.java:50) at com.intellij.openapi.externalSystem.service.project.manage.ProjectDataManager.doImportData(ProjectDataManager.java:246) at com.intellij.openapi.externalSystem.service.project.manage.ProjectDataManager.importData(ProjectDataManager.java:143) at com.intellij.openapi.externalSystem.service.project.manage.ProjectDataManager.importData(ProjectDataManager.java:198) at […]

Fehler beim Auflösen: com.google.android.gms: Play-Services-Messung: 9.6.1

Heute habe ich alle meine Support-Bibliotheken und Buildtools auf die neueste Version aktualisiert, um Android N zu unterstützen. Sobald ich alles aktualisiert und rannte die app, bekam ich einen Fehler in InstanceId Generation Methode von GCM in meiner App. Also habe ich gesucht und gefunden Lösungen, die vorgeschlagen, um Play-Services zu aktualisieren. Nachdem ich alle […]

Signing Config pro Geschmack nicht funktioniert

Ich habe eine Android-App, die 2 Geschmacksrichtungen hat: internal und production , und es gibt auch 2 Build-Typen: debug und release . Ich versuche, Signing-Configs basierend auf dem Geschmack zuzuordnen, was laut der Dokumentation möglich ist. Ich habe gesehen und andere Antworten gefunden, aber keiner von ihnen scheint zu arbeiten. Alles kompiliert, aber die App […]

Das Android ist ein Google Android Fan-Website, Alles รผber Android Phones, Android Wear, Android Dev und Android Spiele Apps und so weiter.