Tag: android gradle

Der Debugger-Port konnte nicht geöffnet werden: java.net.SocketException "Socket closed"

Ich benutze Android Studio, mit mehreren Geschmacksrichtungen mit Gradle, jeweils mit einem Debug- und Release-Typ, wie hier beschrieben beschrieben , in der unteren Hälfte. Wenn ich versuche, den Debugger zu starten, bekomme ich diesen Fehler: Error running androidRecover [installAppDebug]: Unable to open debugger port : java.net.SocketException "Socket closed Ich bin auch nicht in der Lage, […]

Android gradle javadoc Annotation existiert nicht

Ich versuche, einen Aar zu bauen, um auf jcenter zu veröffentlichen. Die assembleRelease Aufgabe funktioniert ok, die javadoc Aufgabe funktioniert auch gut, aber die javadocJar Aufgabe gibt diesen Fehler aus: /Users/martinmoreno/Projects/android-dev-utils/dev-utils/src/main/java/com/tinchoapps/devutils/BitmapUtils.java:11: error: package android.support.annotation does not exist import android.support.annotation.NonNull; Hier ist die (vereinfachte) Gradle-Datei: apply plugin: 'com.android.library' apply plugin: 'com.github.dcendents.android-maven' android { … buildTypes { […]

Wie funktioniert das neue applicationId in build.gradle?

Google veröffentlicht Version 0.11 des Android Gradle Plugins. Die Release Notes enthält folgendes: Einer der sichtbaren Änderungen des Benutzers in 0.11 ist, dass wir die Einstellungen packageName und packageNameSuffix veraltet haben und sie in ApplicationId und ApplicationIdSuffix umbenannt haben. Der Zweck davon ist, dass es klar ist, dass diese Applikations-ID von Paketdeklarationen in Ihrem Manifest […]

Android Studios RuntimeException: Unerwartete Ausnahme in dex Schriftsteller Thread

Ich habe diesen seltsamen Fehler schon heute bekommen – jemand weiß, was hier los ist? Soweit ich weiß, habe ich die Multidex-Bibliothek richtig benutzt (die unten ist aus der app.gradle-Datei): defaultConfig { applicationId "com.example.simon" minSdkVersion 14 targetSdkVersion 23 versionCode 1 versionName "1.0" /*Enabling multidex*/ multiDexEnabled true } dependencies { /* Enabling multidex*/ compile 'com.android.support:multidex:1.0.1' } […]

Fehler beim Abrufen von übergeordneten Elementen: Keine Ressource gefunden, die dem Vornamen 'android: TextAppearance.Material.Widget.Button.Borderless.Colored' entspricht,

Ich habe diese Fehler erhalten, als ich neues Projekt im Android-Studio begann. Fehler: (1) Fehler beim Abrufen von übergeordneten Elementen: Keine Ressource gefunden, die dem Vornamen 'android: TextAppearance.Material.Widget.Button.Borderless.Colored' entspricht. Fehler: (1) Fehler beim Abrufen von übergeordneten Elementen: Keine Ressource gefunden, die dem Vornamen 'android: TextAppearance.Material.Widget.Button.Borderless.Colored' entspricht. Fehler: Ausführung fehlgeschlagen für Task ': app: processDebugResources'. Com.android.ide.common.process.Process.xcessException: […]

Gradle bauen fehlgeschlagen nach Update auf Android Studio 2.3 Kanarischen 3

Ich habe vor kurzem die Android-Studio-Version meines Projekts von 2.3 Kanarischen 2 bis 2.3 Kanarischen 3 aktualisiert. Seitdem fällt der Gradle-Build jedes Mal mit diesem Fehler aus: Fehler: Die Methode 'org.gradle.api.tasks.Sync.getInputs kann nicht gefunden werden () Lorg / gradle / api / intern / TaskInputsInternal;'. Mögliche Ursachen für diesen unerwarteten Fehler sind: Der Abhängigkeits-Cache von […]

Konnte nicht finden com.google.android.gms: Play-Services: 7.3.0

Ich habe dieses Log von Android Studio gradle: Error:A problem occurred configuring project ':ParseStarterProject'. > Could not resolve all dependencies for configuration ':ParseStarterProject:_debugCompile'. > Could not find com.google.android.gms:play-services:7.5.0. Searched in the following locations: https://repo1.maven.org/maven2/com/google/android/gms/play-services/7.5.0/play-services-7.5.0.pom https://repo1.maven.org/maven2/com/google/android/gms/play-services/7.5.0/play-services-7.5.0.jar Required by: Parse:ParseStarterProject:unspecified Wie in der Welt kann es nicht lokal aussehen, wo es ist (andere Projekte sehen und normalerweise […]

Android Studio plötzlich angefangen zu zeigen, nicht in der Lage zu lösen com.android.support … 25.0.0 Fehlermeldungen und alle meine Java-Dateien sind jetzt falsch?

Mein Projekt war sehr gut, aber bis eines Tages, als ich mein Projekt auf Github hochgeladen habe. Ich weiß nicht, ob diese Frage damit zusammenhängt, aber heute, als ich mein Android-Studio-Projekt kompilierte, fing es an, mir diese 4 schrecklichen Fehler zu zeigen. Ich habe die meisten der Google-Ergebnisse ausprobiert, aber keine Hilfe! Fehler: Fehler beim […]

Android Studio / Gradle Build scheitert im Release: Konnte nicht die Abhängigkeiten der Task ': app: crashlyticsStoreDeobsRelease'

Der Build scheitert nur in Release, Debug baut gut aus. Android Studio 1.4, Gradle 2.8 RC1, Gradle Plugin 1.4.0 BETA 4 FAILURE: Build failed with an exception. * Exception is: org.gradle.api.GradleException: Could not determine the dependencies of task ':app:crashlyticsStoreDeobsRelease'. … Error:org.gradle.api.UnknownTaskException: Task with path 'dexRelease' not found in project ':app'.

Wie benutzt man ThreeTenABP in Android Project

Ich füge diese Frage hinzu, weil ich neu in Java und Android bin und ich suchte stundenlang, um das herauszufinden. Die Antwort kam aus einer Kombination von verwandten Antworten, so dass ich dachte, ich würde dokumentieren, was ich für jeden anderen gelernt, der vielleicht kämpfen kann. Siehe Antwort. Für ein bisschen Hintergrund, ist meine Erfahrung […]

Das Android ist ein Google Android Fan-Website, Alles ├╝ber Android Phones, Android Wear, Android Dev und Android Spiele Apps und so weiter.