Tag: android gradle

Fehler beim Auflösen: com.google.android.gms: Play-Services-Besetzung: 9.8.00

Ich benutze Android Studio und habe die CastVideo v2 Referenz App geklont und mit der CastCompanionLibrary nach ihren Anweisungen eingerichtet. Allerdings, wenn ich versuche, das gradle-Projekt zu synchronisieren, heißt es: Fehler beim Auflösen Failed to resolve: com.google.android.gms:play-services-cast:9.8.00 . Ich habe die Möglichkeit, Install Repository and sync project zu Install Repository and sync project aber es […]

Fehler in generierten Werten-23-Datei in Android

Ich bekomme diesen Fehler, wenn ich versuche, mein Projekt zu bauen. Error:(3, 5) No resource found that matches the given name (at 'cardBackgroundColor' with value '?android:attr/colorBackgroundFloating'). Error:Execution failed for task ':app:processDebugResources'. com.android.ide.common.process.ProcessException: org.gradle.process.internal.ExecException: Process 'command 'C:\Users\Home\AppData\Local\Android\sdk\build-tools\23.0.2\aapt.exe'' finished with non-zero exit value 1 Und wenn ich darauf klicke, braucht es mich in die v-23-Werte-Datei des generierten […]

Setzen Sie eine globale Variable in gradle, die in manifest-Datei verwenden können

Ich möchte eine globale Variable ähnlich mit applicationId erstellen. Es ist ein Wert in build.gradle und wird in manifest verwendet. Ist es möglich?

Fehler beim Ausführen von reaktionsfähigem Run-android –variant = release (Task 'installReleaseDebug' nicht im Root-Projekt 'gnosisapp' gefunden).

Ich habe diesen Fehler versucht zu react-native run-android –variant=release Starting JS server… Running /home/sonic182/Android/platform-tools/adb -s ZY2232QD4K reverse tcp:8081 tcp:8081 Building and installing the app on the device (cd android && ./gradlew installReleaseDebug)… FAILURE: Build failed with an exception. * What went wrong: Task 'installReleaseDebug' not found in root project 'gnosisapp'. * Try: Run gradlew tasks […]

Wie man meinen gradle für endgültige freigabe apk setzt

Früher war mein gradle wie folgt: WAS IST DAS KÖNNEN apply plugin: 'android' android { compileSdkVersion 19 buildToolsVersion '19.0.3' defaultConfig { minSdkVersion 11 targetSdkVersion 19 versionCode 1 versionName "1.0" } buildTypes { release { runProguard false proguardFiles getDefaultProguardFile('proguard-android.txt'), 'proguard-rules.txt' } } } dependencies { compile 'com.android.support:gridlayout-v7:19.0.1' compile 'com.android.support:appcompat-v7:+' compile fileTree(dir: 'libs', include: ['*.jar']) compile 'com.android.support:support-v4:+' […]

Definiere buildConfigField für androidTest

Ich definiere ein bestimmtes Feld in der BuildConfig für das Erhalten der URL während der Laufzeit. Also, für jeden Build-Typ, benutze ich eine andere Zeichenfolge: prod { buildConfigField "String", "BASE_URL", "\"abc.com\"" } debug { buildConfigField "String", "BASE_URL", "\"efg.com\"" } Ist es möglich, eine andere URL zu definieren, während die Android-Tests laufen? Ich habe versucht, diese […]

Java.io.IOException: com.android.jack.api.v01.CompilationException: konnte nicht kompiliert werden

Unten ist der Fehler, den ich bei der Migration yo Java 8 mit API Level 24 bekomme. Sieht aus wie aus lombok Pre-Prozessor. Jede Hilfe geschätzt Fehler: /MyApp.native.android/AndroidApp/src/main/java/com/cba/MyApp/android/view/fragment/ProfileDetails/tabs/Profile.java: 21: Der Import lombok kann nicht aufgelöst werden FAILURE: Build failed with an exception. * What went wrong: Execution failed for task ':AndroidApp:compileMyAppDebugJavaWithJack'. > java.io.IOException: com.android.jack.api.v01.CompilationException: Failed […]

Umbenennen der Ausgabedatei im neuen Android Plugin 3.0.0-alpha1

Ich habe das in der vorherigen Gradle Plugin und es war gut funktioniert. applicationVariants.all { v -> v.outputs.each { output -> output.outputFile = new File( output.outputFile.parent, output.outputFile.name.replace("app-release.apk", "companyName-app-v${variant.versionName}.apk")) }} Mit dem letzten Update auf 3.0.0-alpha1 zeigt es Fehler. Ich habe den Link https://developer.android.com/studio/preview/features/new-android-plugin-migration.html gelesen, konnte aber nicht die genaue Fehlerquelle finden. Gibt es hier eine […]

Duplizieren Sie die WebRTC-Klasse in Android

Ich bekomme diese Fehler in meiner Android-App und hier ist die LogCat. > Error:Execution failed for task > ':android:transformClassesWithJarMergingForDebug'. > com.android.build.api.transform.TransformException: java.util.zip.ZipException: duplicate entry: > org/webrtc/voiceengine/WebRtcAudioRecord.class Ich versuche, eine zweite WebRTC in meine Android-App zu integrieren, ich habe TokBox-Jar in mein Projekt integriert und nun versuche ich auch, VSee SDK in App zu setzen, ich […]

Gradle 4.0 Eine passende Konfiguration kann nicht gefunden werden

Ich versuche, mein bestehendes Projekt in einem neuen Android Studio 3.0 Kanarienvogel zu öffnen. 2. Ich habe Gradle nach Anweisungen aktualisiert, geänderte Namen für Abhängigkeitskonfigurationen, aber ich bekomme weiterhin den nächsten Fehler: Error:Could not resolve all dependencies for configuration ':bankOK:betaNewApiInnerTestRuntimeClasspath'. > Unable to find a matching configuration in project :abChat: – Configuration 'debugApiElements': – Required […]

Das Android ist ein Google Android Fan-Website, Alles ├╝ber Android Phones, Android Wear, Android Dev und Android Spiele Apps und so weiter.